{"text_format":"1","workbook":"xlsx","n_sheets":4,"sheets":["1 Specifikation","2 Avtalstecknande","Admin","SysAdmin"],"not_rendered":{"charts":0,"images":3,"macros":1,"external_links":1,"defined_names":102,"comments":0,"pivot_tables":0},"unopened":[],"bounds":{"document_bytes":16777216,"sheet_cells":100000,"rows_first":2000,"rows_last":500,"rows_between":2000,"halvings":0,"cell_chars":16384,"cell_head_chars":4096},"cells_cut":0,"cells_raw":0,"read":"whole","date_system":"1900"}

{"sheet":"1 Specifikation","index":0,"n_rows":390,"n_cols":34,"rows_kept":390,"cut":false,"hidden":false,"merged":[[212,1,212,2],[212,3,212,6],[212,7,212,13],[212,16,212,23],[207,1,207,2],[207,3,207,6],[207,7,207,13],[207,16,207,23],[208,1,208,2],[208,3,208,6],[208,7,208,13],[208,16,208,23],[209,1,209,2],[209,3,209,6],[209,7,209,13],[209,16,209,23],[210,1,210,2],[210,3,210,6],[210,7,210,13],[210,16,210,23],[211,1,211,2],[211,3,211,6],[211,7,211,13],[211,16,211,23],[202,3,202,6],[202,7,202,13],[202,16,202,23],[203,1,203,2],[203,3,203,6],[203,7,203,13],[203,16,203,23],[204,1,204,2],[204,3,204,6],[204,7,204,13],[204,16,204,23],[205,1,205,2],[205,3,205,6],[205,7,205,13],[205,16,205,23],[206,1,206,2],[206,3,206,6],[206,7,206,13],[206,16,206,23],[253,1,253,2],[253,3,253,6],[253,7,253,10],[253,12,253,13],[253,16,253,23],[254,1,254,2],[254,3,254,6],[254,7,254,10],[254,12,254,13],[254,16,254,23],[255,1,255,2],[255,3,255,6],[255,7,255,10],[255,12,255,13],[255,16,255,23],[198,1,198,2],[198,3,198,6],[198,7,198,13],[198,16,198,23],[199,1,199,2],[199,3,199,6],[199,7,199,13],[199,16,199,23],[200,1,200,2],[200,3,200,6],[200,7,200,13],[200,16,200,23],[201,1,201,2],[201,3,201,6],[201,7,201,13],[201,16,201,23],[202,1,202,2],[249,1,249,2],[249,3,249,6],[249,7,249,10],[249,12,249,13],[249,16,249,23],[250,1,250,2],[250,3,250,6],[250,7,250,10],[250,12,250,13],[250,16,250,23],[251,1,251,2],[251,3,251,6],[251,7,251,10],[251,12,251,13],[251,16,251,23],[252,1,252,2],[252,3,252,6],[252,7,252,10],[252,12,252,13],[252,16,252,23],[245,7,245,10],[245,12,245,13],[245,16,245,23],[246,1,246,2],[246,3,246,6],[246,7,246,10],[246,12,246,13],[246,16,246,23],[247,1,247,2],[247,3,247,6],[247,7,247,10],[247,12,247,13],[247,16,247,23],[248,1,248,2],[248,3,248,6],[248,7,248,10],[248,12,248,13],[248,16,248,23],[241,12,241,13],[241,16,241,23],[242,1,242,2],[242,3,242,6],[242,7,242,10],[242,12,242,13],[242,16,242,23],[243,1,243,2],[243,3,243,6],[243,7,243,10],[243,12,243,13],[243,16,243,23],[244,1,244,2],[244,3,244,6],[244,7,244,10],[244,12,244,13],[244,16,244,23],[108,2,108,3],[108,4,108,5],[108,6,108,7],[108,8,108,11],[108,15,108,20],[108,21,108,22],[108,23,108,24],[109,2,109,3],[109,4,109,5],[109,6,109,7],[109,8,109,11],[109,15,109,20],[109,21,109,22],[109,23,109,24],[110,2,110,3],[110,4,110,5],[110,6,110,7],[110,8,110,11],[110,15,110,20],[110,21,110,22],[110,23,110,24],[105,2,105,3],[105,4,105,5],[105,6,105,7],[105,8,105,11],[105,15,105,20],[105,21,105,22],[105,23,105,24],[106,2,106,3],[106,4,106,5],[106,6,106,7],[106,8,106,11],[106,15,106,20],[106,21,106,22],[106,23,106,24],[107,2,107,3],[107,4,107,5],[107,6,107,7],[107,8,107,11],[107,15,107,20],[107,21,107,22],[107,23,107,24],[102,2,102,3],[102,4,102,5],[102,6,102,7],[102,8,102,11],[102,15,102,20],[102,21,102,22],[102,23,102,24],[103,2,103,3],[103,4,103,5],[103,6,103,7],[103,8,103,11],[103,15,103,20],[103,21,103,22],[103,23,103,24],[104,2,104,3],[104,4,104,5],[104,6,104,7],[104,8,104,11],[104,15,104,20],[104,21,104,22],[104,23,104,24],[99,2,99,3],[99,4,99,5],[99,6,99,7],[99,8,99,11],[99,15,99,20],[99,21,99,22],[99,23,99,24],[100,2,100,3],[100,4,100,5],[100,6,100,7],[100,8,100,11],[100,15,100,20],[100,21,100,22],[100,23,100,24],[101,2,101,3],[101,4,101,5],[101,6,101,7],[101,8,101,11],[101,15,101,20],[101,21,101,22],[101,23,101,24],[96,2,96,3],[96,4,96,5],[96,6,96,7],[96,8,96,11],[96,15,96,20],[96,21,96,22],[96,23,96,24],[97,2,97,3],[97,4,97,5],[97,6,97,7],[97,8,97,11],[97,15,97,20],[97,21,97,22],[97,23,97,24],[98,2,98,3],[98,4,98,5],[98,6,98,7],[98,8,98,11],[98,15,98,20],[98,21,98,22],[98,23,98,24],[172,16,172,23],[173,1,173,2],[259,12,259,13],[259,16,259,23],[257,1,257,2],[257,3,257,6],[257,7,257,10],[257,12,257,13],[257,16,257,23],[258,1,258,2],[258,3,258,6],[258,7,258,10],[258,12,258,13],[258,16,258,23],[238,12,238,13],[238,16,238,23],[239,1,239,2],[239,3,239,6],[239,7,239,10],[239,12,239,13],[239,16,239,23],[240,1,240,2],[240,3,240,6],[240,7,240,10],[240,12,240,13],[240,16,240,23],[256,1,256,2],[256,3,256,6],[256,7,256,10],[256,12,256,13],[256,16,256,23],[173,7,173,13],[173,16,173,23],[235,1,235,2],[235,3,235,6],[235,7,235,10],[235,12,235,13],[235,16,235,23],[197,16,197,23],[214,16,214,23],[213,16,213,23],[215,16,215,23],[223,1,223,2],[217,1,217,2],[225,16,225,23],[218,1,218,2],[218,3,218,6],[176,7,176,13],[197,7,197,13],[213,7,213,13],[215,7,215,13],[216,7,216,13],[227,1,227,2],[176,16,176,23],[224,12,224,13],[216,16,216,23],[217,16,217,23],[218,16,218,23],[222,1,222,4],[225,7,225,10],[225,3,225,6],[216,3,216,6],[217,3,217,6],[217,7,217,13],[126,5,126,11],[167,16,167,23],[168,1,168,2],[168,3,168,6],[168,7,168,13],[168,16,168,23],[169,1,169,2],[169,3,169,6],[169,7,169,13],[169,16,169,23],[170,1,170,2],[170,3,170,6],[170,7,170,13],[170,16,170,23],[171,1,171,2],[171,3,171,6],[171,7,171,13],[171,16,171,23],[164,16,164,23],[165,1,165,2],[165,3,165,6],[165,7,165,13],[165,16,165,23],[166,1,166,2],[166,3,166,6],[166,7,166,13],[166,16,166,23],[142,1,142,3],[154,16,154,23],[155,16,155,23],[156,16,156,23],[157,16,157,23],[158,16,158,23],[159,16,159,23],[160,16,160,23],[161,16,161,23],[162,16,162,23],[160,7,160,13],[163,7,163,13],[94,2,94,3],[94,4,94,5],[94,6,94,7],[94,8,94,11],[94,15,94,20],[94,21,94,22],[94,23,94,24],[95,2,95,3],[95,4,95,5],[95,6,95,7],[95,8,95,11],[95,15,95,20],[95,21,95,22],[95,23,95,24],[111,2,111,3],[111,4,111,5],[111,6,111,7],[111,8,111,11],[111,15,111,20],[111,21,111,22],[111,23,111,24],[155,7,155,13],[158,1,158,2],[161,7,161,13],[118,21,118,22],[91,2,91,3],[91,4,91,5],[91,6,91,7],[91,8,91,11],[91,15,91,20],[91,21,91,22],[91,23,91,24],[92,2,92,3],[92,4,92,5],[92,6,92,7],[92,8,92,11],[92,15,92,20],[92,21,92,22],[92,23,92,24],[93,2,93,3],[93,4,93,5],[93,6,93,7],[93,8,93,11],[93,15,93,20],[93,21,93,22],[93,23,93,24],[87,21,87,22],[87,23,87,24],[88,2,88,3],[88,4,88,5],[88,6,88,7],[88,8,88,11],[88,15,88,20],[88,21,88,22],[88,23,88,24],[89,2,89,3],[89,4,89,5],[89,6,89,7],[89,8,89,11],[89,15,89,20],[89,21,89,22],[89,23,89,24],[90,2,90,3],[90,4,90,5],[90,6,90,7],[90,8,90,11],[90,15,90,20],[90,21,90,22],[90,23,90,24],[52,4,52,5],[53,4,53,5],[60,6,60,7],[61,6,61,7],[62,6,62,7],[51,6,51,7],[52,6,52,7],[53,6,53,7],[54,6,54,7],[55,6,55,7],[56,6,56,7],[57,6,57,7],[58,6,58,7],[59,6,59,7],[54,4,54,5],[55,4,55,5],[56,4,56,5],[57,4,57,5],[58,4,58,5],[59,4,59,5],[63,23,63,24],[62,23,62,24],[66,23,66,24],[113,23,113,24],[65,23,65,24],[57,23,57,24],[59,15,59,20],[58,15,58,20],[58,21,58,22],[63,15,63,20],[61,2,61,3],[62,2,62,3],[63,2,63,3],[64,2,64,3],[65,2,65,3],[66,2,66,3],[57,8,57,11],[58,8,58,11],[59,8,59,11],[60,8,60,11],[61,8,61,11],[60,4,60,5],[61,4,61,5],[62,4,62,5],[63,4,63,5],[64,4,64,5],[77,4,77,5],[77,6,77,7],[87,4,87,5],[87,6,87,7],[87,8,87,11],[87,15,87,20],[58,2,58,3],[59,2,59,3],[60,2,60,3],[175,16,175,23],[54,8,54,11],[55,8,55,11],[56,8,56,11],[65,4,65,5],[66,4,66,5],[62,8,62,11],[63,8,63,11],[64,8,64,11],[65,8,65,11],[66,8,66,11],[63,6,63,7],[64,6,64,7],[65,6,65,7],[66,6,66,7],[87,2,87,3],[149,11,151,13],[153,16,153,23],[163,16,163,23],[174,16,174,23],[161,1,161,2],[154,7,154,13],[152,1,152,4],[120,5,120,11],[77,2,77,3],[60,23,60,24],[58,23,58,24],[59,23,59,24],[61,23,61,24],[8,9,8,14],[9,9,9,14],[381,1,381,8],[286,1,286,2],[291,1,291,2],[287,1,287,2],[339,1,339,8],[329,1,329,8],[330,1,330,8],[341,1,341,8],[344,1,344,8],[336,1,336,8],[335,1,335,8],[333,1,333,8],[359,1,359,8],[360,1,369,8],[301,1,301,3],[288,3,288,6],[343,1,343,8],[340,1,340,8],[155,1,155,2],[215,3,215,6],[282,1,282,2],[282,12,282,13],[282,7,282,10],[283,7,283,10],[282,3,282,6],[158,7,158,13],[159,7,159,13],[225,1,225,2],[216,1,216,2],[224,3,224,6],[283,16,283,23],[282,16,282,23],[236,1,236,2],[236,3,236,6],[236,7,236,10],[236,12,236,13],[236,16,236,23],[237,1,237,2],[237,3,237,6],[237,7,237,10],[237,12,237,13],[237,16,237,23],[238,1,238,2],[47,25,47,42],[154,3,154,6],[224,16,224,23],[223,12,223,13],[223,16,223,23],[142,11,145,13],[220,11,221,13],[218,7,218,13],[54,23,54,24],[53,15,53,20],[52,21,52,22],[52,15,52,20],[57,15,57,20],[64,23,64,24],[214,7,214,13],[163,3,163,6],[225,12,225,13],[156,7,156,13],[157,7,157,13],[174,7,174,13],[167,1,167,2],[167,3,167,6],[167,7,167,13],[172,1,172,2],[172,3,172,6],[172,7,172,13],[162,1,162,2],[162,3,162,6],[174,1,174,2],[174,3,174,6],[177,7,177,13],[180,7,180,13],[183,7,183,13],[186,7,186,13],[175,1,175,2],[175,7,175,13],[162,7,162,13],[164,1,164,2],[164,3,164,6],[164,7,164,13],[192,7,192,13],[195,3,195,6],[195,7,195,13],[176,1,176,2],[176,3,176,6],[214,1,214,2],[214,3,214,6],[158,3,158,6],[159,1,159,2],[159,3,159,6],[197,3,197,6],[175,3,175,6],[156,3,156,6],[157,1,157,2],[157,3,157,6],[160,1,160,2],[160,3,160,6],[161,3,161,6],[177,1,177,2],[177,3,177,6],[180,1,180,2],[180,3,180,6],[183,1,183,2],[183,3,183,6],[186,1,186,2],[186,3,186,6],[189,1,189,2],[189,3,189,6],[192,1,192,2],[192,3,192,6],[173,3,173,6],[195,1,195,2],[126,15,126,20],[126,21,126,22],[124,15,124,20],[124,21,124,22],[117,15,117,20],[117,21,117,22],[117,1,117,3],[118,1,118,3],[120,1,120,3],[122,1,122,3],[64,21,64,22],[64,15,64,20],[153,1,153,2],[66,21,66,22],[65,15,65,20],[66,15,66,20],[137,1,137,9],[115,1,115,5],[144,1,144,3],[153,7,153,13],[124,1,124,3],[126,1,126,3],[128,1,128,3],[130,1,130,3],[117,5,117,11],[118,5,118,11],[122,5,122,11],[124,5,124,11],[128,5,128,11],[130,5,130,11],[77,8,77,11],[77,15,77,20],[33,3,33,4],[30,6,30,8],[46,4,46,5],[46,6,46,7],[47,4,47,5],[61,21,61,22],[61,15,61,20],[45,15,45,16],[56,21,56,22],[60,21,60,22],[57,21,57,22],[59,21,59,22],[60,15,60,20],[55,15,55,20],[51,15,51,20],[49,15,49,20],[49,21,49,22],[48,21,48,22],[46,8,46,11],[47,8,47,11],[48,8,48,11],[49,8,49,11],[50,8,50,11],[51,8,51,11],[52,8,52,11],[53,8,53,11],[52,2,52,3],[53,2,53,3],[54,2,54,3],[55,2,55,3],[56,2,56,3],[57,2,57,3],[29,6,29,8],[50,4,50,5],[51,4,51,5],[38,1,38,10],[39,1,39,10],[41,1,41,10],[10,4,10,6],[10,7,10,8],[11,4,11,6],[11,7,11,8],[10,1,10,3],[13,4,13,8],[14,4,14,8],[32,1,32,2],[15,15,15,17],[30,3,30,4],[36,1,36,2],[36,3,36,4],[19,1,24,8],[35,3,35,4],[36,6,36,7],[32,3,32,4],[33,1,33,2],[27,15,27,22],[15,4,15,8],[15,18,15,22],[29,3,29,4],[14,15,14,18],[14,19,14,22],[26,15,26,22],[10,15,10,18],[19,15,23,22],[11,19,11,20],[11,21,11,22],[12,15,12,18],[11,1,11,3],[12,1,12,3],[10,19,10,22],[12,21,12,22],[13,15,13,18],[16,1,16,3],[15,1,15,3],[9,7,9,8],[13,1,13,3],[12,7,12,8],[12,4,12,6],[9,15,9,18],[9,19,9,22],[13,19,13,22],[29,1,29,2],[35,6,35,7],[2,1,2,4],[2,15,2,17],[2,19,2,22],[3,1,4,8],[3,15,4,22],[7,1,7,6],[7,7,7,8],[7,15,7,20],[7,21,7,22],[5,1,5,8],[6,1,6,8],[5,9,6,14],[3,9,3,14],[4,9,4,14],[7,9,7,14],[8,15,8,20],[11,15,11,18],[14,1,14,3],[27,1,27,8],[35,1,35,2],[30,1,30,2],[8,1,8,6],[8,7,8,8],[8,21,8,22],[9,1,9,3],[9,4,9,6],[16,4,16,8],[16,18,16,22],[16,15,16,17],[12,19,12,20],[52,23,52,24],[53,21,53,22],[53,23,53,24],[54,15,54,20],[54,21,54,22],[47,21,47,22],[389,19,389,22],[386,15,387,22],[383,15,383,22],[382,15,382,22],[385,15,385,22],[381,15,381,22],[333,15,333,18],[298,18,299,19],[303,20,303,21],[314,18,314,19],[321,20,321,21],[318,17,319,19],[315,20,315,21],[301,20,301,21],[320,18,320,19],[302,20,302,21],[379,15,380,22],[339,15,339,18],[372,15,372,22],[375,15,375,22],[298,20,299,21],[298,17,299,17],[116,20,116,22],[131,20,131,22],[129,20,129,22],[121,20,121,22],[50,23,50,24],[51,23,51,24],[46,23,46,24],[47,23,47,24],[47,15,47,20],[46,15,46,20],[46,21,46,22],[42,1,42,10],[48,15,48,20],[45,1,45,4],[44,5,45,10],[48,2,48,3],[49,2,49,3],[50,2,50,3],[51,2,51,3],[47,6,47,7],[48,6,48,7],[49,6,49,7],[50,6,50,7],[51,21,51,22],[48,23,48,24],[49,23,49,24],[50,15,50,20],[50,21,50,22],[46,2,46,3],[47,2,47,3],[49,4,49,5],[48,4,48,5],[56,23,56,24],[56,15,56,20],[55,21,55,22],[55,23,55,24],[227,12,227,13],[227,16,227,23],[65,21,65,22],[153,3,153,6],[143,1,143,9],[149,10,152,10],[224,7,224,10],[220,7,220,9],[223,3,223,6],[223,7,223,10],[215,1,215,2],[140,4,140,8],[138,1,138,9],[148,1,149,9],[145,1,145,9],[151,1,151,5],[154,1,154,2],[163,1,163,2],[147,1,147,9],[213,1,213,2],[155,3,155,6],[156,1,156,2],[63,21,63,22],[62,15,62,20],[62,21,62,22],[123,20,123,22],[125,20,125,22],[127,20,127,22],[284,1,284,2],[280,3,280,6],[234,12,234,13],[234,16,234,23],[280,12,280,13],[287,16,287,23],[227,7,227,10],[233,7,233,10],[226,7,226,10],[226,3,226,6],[226,12,226,13],[229,16,229,23],[228,12,228,13],[232,12,232,13],[230,12,230,13],[232,16,232,23],[226,16,226,23],[231,12,231,13],[231,16,231,23],[230,16,230,23],[229,12,229,13],[233,16,233,23],[233,12,233,13],[228,16,228,23],[283,1,283,2],[283,12,283,13],[281,12,281,13],[281,16,281,23],[280,16,280,23],[234,7,234,10],[280,7,280,10],[281,7,281,10],[309,25,309,27],[295,18,297,23],[288,12,288,13],[288,16,288,23],[285,16,285,23],[298,22,299,23],[284,7,284,10],[299,11,299,12],[295,17,297,17],[295,15,297,16],[291,17,291,18],[290,12,290,13],[284,12,284,13],[284,16,284,23],[300,22,302,23],[300,18,300,19],[298,16,299,16],[279,1,279,2],[279,3,279,6],[281,1,281,2],[232,3,232,6],[233,3,233,6],[232,1,232,2],[228,7,228,10],[229,7,229,10],[230,7,230,10],[231,7,231,10],[232,7,232,10],[281,3,281,6],[230,1,230,2],[229,1,229,2],[233,1,233,2],[261,7,261,10],[264,7,264,10],[267,7,267,10],[270,7,270,10],[273,7,273,10],[276,7,276,10],[279,7,279,10],[238,3,238,6],[238,7,238,10],[259,1,259,2],[259,3,259,6],[259,7,259,10],[241,1,241,2],[241,3,241,6],[241,7,241,10],[245,1,245,2],[245,3,245,6],[375,1,375,8],[342,1,342,8],[373,1,373,8],[372,1,372,8],[353,1,353,8],[354,1,356,8],[358,1,358,5],[348,1,348,8],[349,1,349,8],[350,1,350,8],[328,1,328,8],[288,1,288,2],[300,11,300,12],[315,1,321,13],[317,18,317,19],[316,18,316,19],[316,20,316,21],[308,17,309,18],[291,12,291,13],[292,12,292,13],[291,19,291,20],[314,20,314,21],[320,20,320,21],[347,1,347,8],[347,15,347,18],[283,3,283,6],[284,3,284,6],[334,1,334,8],[286,3,286,6],[285,7,285,10],[286,7,286,10],[287,7,287,10],[288,7,288,10],[287,12,287,13],[306,15,306,16],[306,17,306,18],[307,1,309,13],[285,12,285,13],[285,1,285,2],[303,18,303,19],[287,3,287,6],[286,12,286,13],[285,3,285,6],[286,16,286,23],[329,23,378,27],[374,1,374,8],[302,18,302,19],[373,15,373,22],[374,15,374,22],[300,20,300,21],[301,18,301,19],[314,1,314,13],[325,1,325,8],[327,15,327,18],[317,20,317,21],[327,1,327,8],[324,1,324,5],[77,21,77,22],[77,23,77,24],[78,2,78,3],[78,4,78,5],[78,6,78,7],[78,8,78,11],[78,15,78,20],[78,21,78,22],[78,23,78,24],[124,23,124,24],[132,23,132,24],[134,23,134,24],[126,23,126,24],[128,15,128,20],[128,21,128,22],[128,23,128,24],[130,15,130,20]],"merged_total":1304,"flags":["merged_cut"]}
[]
[null,null,null,null,null,null,null,null,null,null,null,null,null,null,{"$f":"\"Avrop nr: \"&B15","v":"Avrop nr: "},null,null,null,null,null,null,null,{"$f":"\"Avrop nr: \"&B15","v":"Avrop nr: "}]
[null,"Avropsförfrågan",null,null,null,null,null,null,null,null,null,null,null,null,null,"Avropssvar",null,null,null,{"$f":"IF(LarmStatus,\"Minst ett av de obligatoriska kraven är inte ifyllda eller besvarade med Nej\",\"\")","v":"Minst ett av de obligatoriska kraven är inte ifyllda eller besvarade med Nej"},null,null,null,null,null,null,null,null,null,null,null,null,null,{"$f":"OR(AH4:AH1035)","v":true}]
[null,"Instruktion till avropande organisation: \nSpara ned blanketten på din dator.\nGulmarkerade rutor fylls i av avropare innan blanketten skickas.\n\nBlanketten skickas med e-post till antagna leverantörer inom aktuellt avropsområde.\nSe vidare \"Vägledning vid avrop\".",null,null,null,null,null,null,null,"Ramavtalsområde",null,null,null,null,null,"Instruktion till leverantör:\nBlåmarkerade rutor fylls i av leverantören.\nLäs och kontrollera obligatoriska krav.\nReturnera blanketten med e-post till avropande organisation (oavsett Ja eller Nej).\nMer information finns under vissa rubriker"]
[null,null,null,null,null,null,null,null,null,"Möbler och inredning"]
[null,"Steg 1 - Administrativa uppgifter",null,null,null,null,null,null,null,"Avrop med förnyad konkurrensutsättning\nKammarkollegiets diarienr. "]
[null,"Uppgifter om avropande organisation",null,null,null,null,null,null,null,null,null,null,null,null,null,"Uppgifter om Ramavtalsleverantören"]
[null,"Myndighet/Organisation (namn)",null,null,null,null,null,"Organisationsnummer",null,"23.3-8004-18",null,null,null,null,null,"Ramavtalsleverantörens namn",null,null,null,null,null,"Organisationsnummer"]
[null,null,null,null,null,null,null,null,null,"Avropsblankett",null,null,null,null,null,null,null,null,null,null,null,{"$f":"IFERROR(INDEX(Admin!$E$61:$E$105,MATCH('1 Specifikation'!$P$9,Admin!$C$61:$C$105,0)),\"\")","v":""}]
[null,"Postadress",null,null,"Postnummer",null,null,"Ort",null,"Version 2,0",null,null,null,null,null,"Kontaktperson",null,null,null,"E-post"]
{"$rows_left_out":381}
{"sheet":"2 Avtalstecknande","index":1,"n_rows":33,"n_cols":4,"rows_kept":33,"cut":false,"hidden":false,"merged":[[37,1,37,3],[18,1,18,3],[33,1,33,3],[5,1,5,3],[34,1,34,3],[35,1,35,3],[36,1,36,3],[7,1,7,3],[9,1,9,3],[11,1,11,3],[14,1,14,3],[15,1,15,3]]}
[null,null,null,{"$f":"\"Avrop nr: \"&'1 Specifikation'!B15","v":"Avrop nr: "}]
[]
[]
[]
[null,"Kontrakt"]
[null,{"$f":"\"Detta kontrakt reglerar avrop från ramavtalsområde \"&'1 Specifikation'!J5&\", \"&'1 Specifikation'!J8","v":"Detta kontrakt reglerar avrop från ramavtalsområde Möbler och inredning, 23.3-8004-18"}]
[null,"Kontraktets omfattning"]
[null,"Leveransens omfattning och villkor framgår av Kontraktet med tillhörande bilagor samt Ramavtalet. Om handlingarna innehåller motstridiga uppgifter ska handlingarna gälla i nedan nämnd ordning om inte omständigheterna uppenbarligen föranleder annat."]
[null,"1. Skriftliga ändringar och tillägg till Kontrakt"]
[null,"2. Kontrakt med bilagor, inkl. Allmänna villkor"]
{"$rows_left_out":24}
{"sheet":"Admin","index":2,"n_rows":282,"n_cols":33,"rows_kept":282,"cut":false,"hidden":true,"merged":[]}
[null,null,null,null,null,null,null,null,null,null,null,null,null,null,null,"ResVarTja"]
[null,null,null,{"$f":"C6","v":"Arbetsplats och förvaring mer än 500 000 SEK vid varje avrop"},{"$f":"C7","v":"Möten och paus mer än 500 000 SEK vid varje avrop"},{"$f":"C8","v":"Textil och inredning för fönstermiljö mer än 300 000 SEK vid varje avrop"},{"$f":"C9","v":"Arkiv och magasin mer än 300 000 SEK vid varje avrop"},{"$f":"C10","v":"Förvaring i plåt mer än 300 000 SEK vid varje avrop"},{"$f":"C11","v":"Utemöbler mer än 100 000 SEK vid varje avrop"},{"$f":"C12","v":"Arbetsplatsarmaturer mer än 100 000 SEK vid varje avrop"},{"$f":"C13","v":"Inredningsarmaturer mer än 100 000 SEK vid varje avrop"},{"$f":"C14","v":"Skrivtavlor och AV-inredning mer än 100 000 SEK vid varje avrop"},{"$f":"C15","v":"Lager och verkstadsmiljö mer än 100 000 SEK vid varje avrop"},{"$f":"C16","v":"Textila mattor mer än 300 000 SEK vid varje avrop"},{"$f":"C17","v":"Arbetsstolar mer än 500 000 SEK vid varje avrop"},{"$f":"IF(USRDelområde=\"Välj delområde\",\"\",USRDelområde)","v":""}]
[null,null,"TblDelområde","Välj tjänst","Välj tjänst","Välj tjänst","Välj tjänst","Välj tjänst","Välj tjänst","Välj tjänst","Välj tjänst","Välj tjänst","Välj tjänst","Välj tjänst","Välj tjänst","Välj vara/tjänst"]
[]
[null,null,"Välj delområde","Stöd vid arbetsplatsutformning","Stöd vid arbetsplatsutformning","Akustikutredning, akustikmätning","Stöd vid arbetsplatsutformning","Mätning av rumsytor, golv och fönster","Märkning av t.ex. rumsnummer på möbler eller textilier","Stöd vid arbetsplatsutformning","Utplacering av varor på anvisade platser","Stöd vid arbetsplatsutformning","Utplacering av varor på anvisade platser","Utplacering av varor på anvisade platser","Stöd vid arbetsplatsutformning",{"$f":"IFERROR(IF(INDEX(D5:O5,MATCH(P$2,D$2:O$2,0))=0,\"\",INDEX(D5:O5,MATCH(P$2,D$2:O$2,0))),\"\")","v":""}]
[null,"A","Arbetsplats och förvaring mer än 500 000 SEK vid varje avrop","Kompletta ritningsförslag","Kompletta ritningsförslag","Kompletta ritningsförslag","Kompletta ritningsförslag","Kompletta ritningsförslag","Utplacering av varor på anvisade platser","Kompletta ritningsförslag","Kompletta ritningsförslag","Kompletta ritningsförslag","Kompletta ritningsförslag","Kompletta ritningsförslag","Kompletta ritningsförslag",{"$f":"IFERROR(IF(INDEX(D6:O6,MATCH(P$2,D$2:O$2,0))=0,\"\",INDEX(D6:O6,MATCH(P$2,D$2:O$2,0))),\"\")","v":""}]
[null,"B","Möten och paus mer än 500 000 SEK vid varje avrop","Akustikutredning, akustikmätning","Akustikutredning, akustikmätning","Mätning av rumsytor, golv och fönster","Mätning av rumsytor, golv och fönster","Utplacering av varor på anvisade platser","Efterdragning","Utplacering av varor på anvisade platser","Märkning av t.ex. rumsnummer på möbler eller textilier","Utplacering av varor på anvisade platser","Fast montering i byggnadsdel som golv, vägg och tak","Mattläggning","Utplacering av varor på anvisade platser",""]
[null,"C","Textil och inredning för fönstermiljö mer än 300 000 SEK vid varje avrop","Mätning av rumsytor, golv och fönster","Mätning av rumsytor, golv och fönster","Utplacering av varor på anvisade platser","Utplacering av varor på anvisade platser","Fast montering i byggnadsdel som golv, vägg och tak","Efterkontroll, besiktning","Fast montering i byggnadsdel som golv, vägg och tak","Ritningsförslag - enklare skisser (kostnadsfritt)","Fast montering i byggnadsdel som golv, vägg och tak","Märkning av t.ex. rumsnummer på möbler eller textilier","Langettering","Märkning av t.ex. rumsnummer på möbler eller textilier",""]
[null,"D","Arkiv och magasin mer än 300 000 SEK vid varje avrop","Utplacering av varor på anvisade platser","Utplacering av varor på anvisade platser","Sömnad, ändringssömnad, reparation","Fast montering i byggnadsdel som golv, vägg och tak","Märkning av t.ex. rumsnummer på möbler eller textilier","Ritningsförslag - enklare skisser (kostnadsfritt)","Märkning av t.ex. rumsnummer på möbler eller textilier",null,"Märkning av t.ex. rumsnummer på möbler eller textilier","Efterdragning","Märkning av t.ex. rumsnummer på möbler eller textilier","Efterkontroll, besiktning",""]
[null,"E","Förvaring i plåt mer än 300 000 SEK vid varje avrop","Fast montering i byggnadsdel som golv, vägg och tak","Fast montering i byggnadsdel som golv, vägg och tak","Märkning av t.ex. rumsnummer på möbler eller textilier","Märkning av t.ex. rumsnummer på möbler eller textilier","Efterkontroll, besiktning",null,"Efterkontroll, besiktning",null,"Efterdragning","Efterkontroll, besiktning","Efterkontroll, besiktning","Ritningsförslag - enklare skisser (kostnadsfritt)",""]
{"$rows_left_out":273}
{"sheet":"SysAdmin","index":3,"n_rows":9,"n_cols":5,"rows_kept":9,"cut":false,"hidden":true,"merged":[]}
["LockStatus",false]
["UKey","Förvaltning21",null,2,{"$f":"INDEX(E3:E5,D2)","v":"Avroppsblanketten är nu upplåst, klicka här för att låsa avropsblanketten."}]
["pkey","Förvaltning21",null,null,"Adminläge! Klicka här för att låsa vita celler."]
["Wkey","Förvaltning21","RGB",null,"Avroppsblanketten är nu upplåst, klicka här för att låsa avropsblanketten."]
["YColor"," ","255, 255, 153",null,"Avroppsblanketten är nu låst, klicka här för att låsa upp avropsblanketten."]
[null,null,"204, 255, 255"]
[null,null,"150, 150, 150",null,"Grund för tilldelning av kontrakt & Utvärderingsmodell"]
[null,null,"204, 255, 204",null,{"$f":"VALUE(IF(ISNUMBER(SEARCH(\"2\",DpDwnTDV))=TRUE,\"2\",\"1\"))","v":2}]
[null,null,"250, 191, 143",null,{"$f":"\"Alt\"&IF(ISNUMBER(SEARCH(\"1\",DpDwnUtvddrop))=TRUE,\"1\",IF(ISNUMBER(SEARCH(\"2\",DpDwnUtvddrop))=TRUE,\"2\",IF(ISNUMBER(SEARCH(\"3\",DpDwnUtvddrop))=TRUE,\"3\",IF(ISNUMBER(SEARCH(\"4\",DpDwnUtvddrop))=TRUE,\"4\"))))","v":"AltFALSE"}]