{"text_format":"1","workbook":"xlsx","n_sheets":4,"sheets":["1 Specifikation","2 Avtalstecknande","Admin","SysAdmin"],"not_rendered":{"charts":0,"images":2,"macros":1,"external_links":1,"defined_names":97,"comments":0,"pivot_tables":0},"unopened":[],"bounds":{"document_bytes":16777216,"sheet_cells":100000,"rows_first":2000,"rows_last":500,"rows_between":2000,"halvings":0,"cell_chars":16384,"cell_head_chars":4096},"cells_cut":0,"cells_raw":0,"read":"whole","date_system":"1900"}

{"sheet":"1 Specifikation","index":0,"n_rows":270,"n_cols":34,"rows_kept":270,"cut":false,"hidden":false,"merged":[[87,5,87,11],[88,5,88,11],[90,5,90,11],[92,5,92,11],[94,5,94,11],[96,5,96,11],[98,5,98,11],[100,5,100,11],[51,2,51,3],[52,2,52,3],[53,2,53,3],[54,2,54,3],[87,1,87,3],[88,1,88,3],[90,1,90,3],[92,1,92,3],[94,1,94,3],[96,1,96,3],[98,1,98,3],[100,1,100,3],[57,2,57,3],[58,2,58,3],[59,2,59,3],[60,2,60,3],[90,23,90,24],[92,15,92,20],[92,21,92,22],[92,23,92,24],[94,23,94,24],[102,23,102,24],[104,23,104,24],[96,23,96,24],[98,15,98,20],[98,21,98,22],[98,23,98,24],[100,15,100,20],[100,21,100,22],[100,23,100,24],[96,15,96,20],[96,21,96,22],[227,15,227,18],[163,3,163,6],[164,3,164,6],[214,1,214,8],[166,3,166,6],[165,7,165,10],[166,7,166,10],[167,7,167,10],[168,7,168,10],[167,12,167,13],[186,15,186,16],[186,17,186,18],[187,1,189,13],[165,12,165,13],[165,1,165,2],[183,18,183,19],[167,3,167,6],[166,12,166,13],[165,3,165,6],[166,16,166,23],[209,23,258,27],[254,1,254,8],[182,18,182,19],[253,15,253,22],[194,1,194,13],[205,1,205,8],[207,15,207,18],[197,20,197,21],[207,1,207,8],[204,1,204,5],[208,1,208,8],[197,18,197,19],[196,18,196,19],[196,20,196,21],[222,1,222,8],[253,1,253,8],[252,1,252,8],[233,1,233,8],[234,1,236,8],[238,1,238,5],[228,1,228,8],[229,1,229,8],[230,1,230,8],[171,19,171,20],[194,20,194,21],[200,20,200,21],[157,3,157,6],[158,3,158,6],[157,1,157,2],[153,7,153,10],[154,7,154,10],[155,7,155,10],[156,7,156,10],[157,7,157,10],[161,3,161,6],[155,1,155,2],[154,1,154,2],[158,1,158,2],[153,3,153,6],[154,3,154,6],[155,3,155,6],[156,3,156,6],[153,1,153,2],[160,1,160,2],[159,1,159,2],[180,20,180,21],[181,18,181,19],[156,1,156,2],[159,3,159,6],[189,25,189,27],[175,18,177,23],[168,12,168,13],[168,16,168,23],[165,16,165,23],[178,22,179,23],[164,7,164,10],[179,11,179,12],[175,17,177,17],[175,15,177,16],[171,17,171,18],[170,12,170,13],[164,12,164,13],[164,16,164,23],[180,22,182,23],[180,18,180,19],[178,16,179,16],[171,21,171,22],[180,11,180,12],[164,1,164,2],[160,3,160,6],[159,12,159,13],[167,16,167,23],[152,7,152,10],[158,7,158,10],[151,7,151,10],[151,3,151,6],[151,12,151,13],[154,16,154,23],[153,12,153,13],[157,12,157,13],[155,12,155,13],[157,16,157,23],[151,16,151,23],[156,12,156,13],[156,16,156,23],[155,16,155,23],[154,12,154,13],[158,16,158,23],[158,12,158,13],[153,16,153,23],[152,12,152,13],[152,16,152,23],[65,21,65,22],[123,3,123,6],[113,1,113,9],[119,10,122,10],[149,7,149,10],[145,7,145,9],[148,3,148,6],[148,7,148,10],[140,1,140,2],[110,4,110,8],[108,1,108,9],[118,1,119,9],[115,1,115,9],[121,1,121,5],[124,1,124,2],[133,1,133,2],[117,1,117,9],[138,1,138,2],[132,1,132,2],[132,3,132,6],[134,1,134,2],[141,7,141,13],[134,3,134,6],[128,3,128,6],[152,1,152,2],[152,3,152,6],[151,1,151,2],[149,1,149,2],[50,23,50,24],[51,23,51,24],[46,23,46,24],[47,23,47,24],[47,15,47,20],[46,15,46,20],[46,21,46,22],[48,23,48,24],[49,23,49,24],[52,23,52,24],[53,21,53,22],[53,23,53,24],[54,15,54,20],[54,21,54,22],[131,3,131,6],[129,3,129,6],[125,1,125,2],[88,15,88,20],[88,21,88,22],[137,1,137,2],[42,1,42,10],[48,15,48,20],[45,1,45,4],[44,5,45,10],[47,6,47,7],[48,6,48,7],[49,6,49,7],[50,6,50,7],[51,21,51,22],[50,15,50,20],[50,21,50,22],[47,2,47,3],[48,2,48,3],[49,2,49,3],[50,2,50,3],[47,21,47,22],[48,8,48,11],[49,8,49,11],[50,8,50,11],[51,8,51,11],[269,19,269,22],[266,15,267,22],[263,15,263,22],[262,15,262,22],[265,15,265,22],[261,15,261,22],[213,15,213,18],[178,18,179,19],[183,20,183,21],[194,18,194,19],[201,20,201,21],[198,17,199,19],[195,20,195,21],[181,20,181,21],[200,18,200,19],[182,20,182,21],[259,15,260,22],[219,15,219,18],[252,15,252,22],[255,15,255,22],[178,20,179,21],[178,17,179,17],[254,15,254,22],[188,17,189,18],[2,1,2,4],[2,15,2,17],[2,19,2,22],[3,1,4,8],[3,15,4,22],[7,1,7,6],[7,7,7,8],[7,15,7,20],[7,21,7,22],[5,1,5,8],[6,1,6,8],[5,9,6,14],[3,9,3,14],[4,9,4,14],[7,9,7,14],[8,15,8,20],[11,15,11,18],[35,1,35,2],[33,1,33,2],[8,1,8,6],[8,7,8,8],[8,21,8,22],[9,1,9,3],[9,4,9,6],[16,4,16,8],[16,18,16,22],[16,15,16,17],[12,19,12,20],[10,15,10,18],[11,19,11,20],[11,21,11,22],[12,15,12,18],[11,1,11,3],[12,1,12,3],[10,19,10,22],[12,21,12,22],[13,15,13,18],[16,1,16,3],[15,1,15,3],[9,7,9,8],[13,1,13,3],[12,7,12,8],[12,4,12,6],[8,9,8,14],[47,4,47,5],[9,19,9,22],[38,1,38,10],[39,1,39,10],[41,1,41,10],[10,4,10,6],[10,7,10,8],[11,4,11,6],[11,7,11,8],[10,1,10,3],[13,4,13,8],[14,4,14,8],[32,1,32,2],[15,15,15,17],[36,1,36,2],[36,3,36,4],[19,1,24,8],[19,15,19,18],[13,19,13,22],[35,3,35,4],[36,6,36,7],[32,3,32,4],[9,9,9,14],[9,15,9,18],[51,15,51,20],[49,15,49,20],[49,21,49,22],[46,2,46,3],[15,4,15,8],[15,18,15,22],[14,15,14,18],[14,19,14,22],[26,15,26,22],[21,15,23,18],[21,19,23,19],[14,1,14,3],[27,1,27,8],[29,1,29,3],[35,6,35,7],[33,3,33,4],[30,1,30,3],[46,4,46,5],[46,6,46,7],[27,15,27,22],[46,8,46,11],[48,21,48,22],[47,8,47,11],[45,15,45,16],[126,3,126,6],[127,1,127,2],[127,3,127,6],[130,1,130,2],[130,3,130,6],[64,21,64,22],[64,15,64,20],[123,1,123,2],[81,21,81,22],[65,15,65,20],[81,15,81,20],[107,1,107,9],[85,1,85,5],[114,1,114,3],[123,7,123,13],[125,3,125,6],[126,1,126,2],[86,20,86,22],[101,20,101,22],[129,1,129,2],[137,3,137,6],[135,3,135,6],[135,1,135,2],[137,7,137,13],[138,7,138,13],[140,7,140,13],[130,7,130,13],[133,7,133,13],[135,7,135,13],[131,7,131,13],[132,7,132,13],[138,3,138,6],[140,3,140,6],[122,1,122,4],[136,1,136,2],[136,3,136,6],[139,1,139,2],[139,3,139,6],[150,12,150,13],[126,7,126,13],[127,7,127,13],[128,7,128,13],[129,7,129,13],[150,1,150,2],[141,1,141,2],[149,3,149,6],[147,1,147,4],[150,7,150,10],[131,1,131,2],[150,3,150,6],[141,3,141,6],[142,3,142,6],[142,7,142,13],[125,7,125,13],[128,1,128,2],[134,7,134,13],[136,7,136,13],[163,1,163,2],[163,12,163,13],[161,12,161,13],[161,16,161,23],[160,16,160,23],[159,7,159,10],[160,7,160,10],[161,7,161,10],[162,7,162,10],[163,7,163,10],[162,3,162,6],[163,16,163,23],[162,16,162,23],[161,1,161,2],[162,1,162,2],[162,12,162,13],[159,16,159,23],[160,12,160,13],[47,25,47,42],[124,3,124,6],[149,16,149,23],[148,12,148,13],[148,16,148,23],[112,11,115,13],[145,11,146,13],[143,7,143,13],[54,23,54,24],[53,15,53,20],[52,21,52,22],[52,15,52,20],[57,15,57,20],[64,23,64,24],[139,7,139,13],[133,3,133,6],[119,11,121,13],[149,12,149,13],[141,16,141,23],[142,16,142,23],[143,16,143,23],[123,16,123,23],[133,16,133,23],[134,16,134,23],[261,1,261,8],[166,1,166,2],[171,1,171,2],[167,1,167,2],[219,1,219,8],[209,1,209,8],[210,1,210,8],[221,1,221,8],[224,1,224,8],[216,1,216,8],[215,1,215,8],[213,1,213,8],[239,1,239,8],[240,1,249,8],[181,1,181,3],[168,3,168,6],[223,1,223,8],[220,1,220,8],[168,1,168,2],[195,1,201,13],[227,1,227,8],[171,12,171,13],[172,12,172,13],[255,1,255,8],[81,6,81,7],[137,16,137,23],[139,16,139,23],[138,16,138,23],[140,16,140,23],[124,16,124,23],[125,16,125,23],[126,16,126,23],[127,16,127,23],[128,16,128,23],[129,16,129,23],[130,16,130,23],[131,16,131,23],[132,16,132,23],[135,16,135,23],[136,16,136,23],[94,15,94,20],[94,21,94,22],[87,15,87,20],[87,21,87,22],[87,23,87,24],[88,23,88,24],[90,15,90,20],[90,21,90,22],[63,2,63,3],[60,6,60,7],[61,6,61,7],[148,1,148,2],[142,1,142,2],[150,16,150,23],[143,1,143,2],[143,3,143,6],[124,7,124,13],[112,1,112,3],[60,23,60,24],[61,23,61,24],[63,23,63,24],[62,23,62,24],[81,23,81,24],[83,23,83,24],[65,23,65,24],[65,2,65,3],[81,2,81,3],[65,4,65,5],[81,4,81,5],[65,8,65,11],[81,8,81,11],[65,6,65,7],[56,21,56,22],[55,15,55,20],[56,23,56,24],[56,15,56,20],[55,21,55,22],[55,23,55,24],[61,8,61,11],[64,2,64,3],[62,4,62,5],[63,4,63,5],[64,4,64,5],[62,8,62,11],[63,8,63,11],[64,8,64,11],[63,6,63,7],[64,6,64,7],[63,21,63,22],[62,15,62,20],[62,21,62,22],[61,21,61,22],[61,15,61,20],[60,21,60,22],[61,2,61,3],[62,2,62,3],[57,23,57,24],[59,15,59,20],[58,15,58,20],[58,21,58,22],[63,15,63,20],[57,21,57,22],[59,21,59,22],[60,15,60,20],[57,8,57,11],[58,8,58,11],[59,8,59,11],[60,8,60,11],[58,23,58,24],[59,23,59,24],[55,2,55,3],[56,2,56,3],[60,4,60,5],[61,4,61,5],[48,4,48,5],[49,4,49,5],[50,4,50,5],[51,4,51,5],[52,4,52,5],[53,4,53,5],[54,4,54,5],[55,4,55,5],[56,4,56,5],[57,4,57,5],[58,4,58,5],[59,4,59,5],[52,8,52,11],[62,6,62,7],[51,6,51,7],[52,6,52,7],[53,6,53,7],[54,6,54,7],[55,6,55,7],[56,6,56,7],[57,6,57,7],[58,6,58,7],[59,6,59,7],[53,8,53,11],[54,8,54,11],[55,8,55,11],[56,8,56,11],[66,2,66,3],[66,4,66,5],[66,6,66,7],[66,8,66,11],[66,15,66,20],[66,21,66,22],[66,23,66,24],[67,2,67,3],[67,4,67,5],[67,6,67,7],[67,8,67,11],[67,15,67,20],[67,21,67,22],[67,23,67,24],[68,2,68,3],[68,4,68,5],[68,6,68,7],[68,8,68,11],[68,15,68,20],[68,21,68,22],[68,23,68,24],[69,2,69,3],[69,4,69,5],[69,6,69,7],[69,8,69,11],[69,15,69,20],[69,21,69,22],[69,23,69,24],[70,2,70,3],[70,4,70,5],[70,6,70,7],[70,8,70,11],[70,15,70,20],[70,21,70,22],[70,23,70,24],[71,2,71,3],[71,4,71,5],[71,6,71,7],[71,8,71,11],[71,15,71,20],[71,21,71,22],[71,23,71,24],[72,2,72,3],[72,4,72,5],[72,6,72,7],[72,8,72,11],[72,15,72,20],[72,21,72,22],[72,23,72,24],[73,2,73,3],[73,4,73,5],[73,6,73,7],[73,8,73,11],[73,15,73,20],[73,21,73,22],[73,23,73,24],[74,2,74,3],[74,4,74,5],[74,6,74,7],[74,8,74,11],[74,15,74,20],[74,21,74,22],[74,23,74,24],[75,2,75,3],[75,4,75,5],[75,6,75,7],[75,8,75,11],[75,15,75,20],[75,21,75,22],[75,23,75,24],[76,2,76,3],[76,4,76,5],[76,6,76,7],[76,8,76,11],[76,15,76,20],[76,21,76,22],[76,23,76,24],[77,2,77,3],[77,4,77,5],[77,6,77,7],[77,8,77,11],[77,15,77,20],[77,21,77,22],[77,23,77,24],[80,2,80,3],[80,4,80,5],[80,6,80,7],[80,8,80,11],[80,15,80,20],[80,21,80,22],[80,23,80,24],[78,2,78,3],[78,4,78,5],[78,6,78,7],[78,8,78,11],[78,15,78,20],[78,21,78,22],[78,23,78,24],[79,2,79,3],[79,4,79,5],[79,6,79,7],[79,8,79,11],[79,15,79,20],[79,21,79,22],[79,23,79,24]]}
[]
[null,null,null,null,null,null,null,null,null,null,null,null,null,null,{"$f":"\"Avrop nr: \"&B15","v":"Avrop nr: "},null,null,null,null,null,null,null,{"$f":"\"Avrop nr: \"&B15","v":"Avrop nr: "}]
[null,"Avropsförfrågan",null,null,null,null,null,null,null,null,null,null,null,null,null,"Avropssvar",null,null,null,{"$f":"IF(LarmStatus,\"Minst ett av de obligatoriska kraven är inte ifyllda eller besvarade med Nej\",\"\")","v":"Minst ett av de obligatoriska kraven är inte ifyllda eller besvarade med Nej"},null,null,null,null,null,null,null,null,null,null,null,null,null,{"$f":"OR(AH4:AH915)","v":true}]
[null,"Instruktion till avropande organisation: \nSpara ned blanketten på din dator.\nGulmarkerade rutor fylls i av avropare innan blanketten skickas.\n\nBlanketten skickas med e-post till antagna leverantörer inom aktuellt avropsområde.\nSe vidare \"Vägledning vid avrop\".",null,null,null,null,null,null,null,"Ramavtalsområde",null,null,null,null,null,"Instruktion till leverantör:\nBlåmarkerade rutor fylls i av leverantören.\nLäs och kontrollera obligatoriska krav.\nReturnera blanketten med e-post till avropande organisation (oavsett Ja eller Nej).\nMer information finns under vissa rubriker"]
[null,null,null,null,null,null,null,null,null,"Möbler och inredning"]
[null,"Steg 1 - Administrativa uppgifter",null,null,null,null,null,null,null,"Avrop med särskild fördelningsnyckel\nKammarkollegiets diarienr. "]
[null,"Uppgifter om avropande organisation",null,null,null,null,null,null,null,null,null,null,null,null,null,"Uppgifter om Ramavtalsleverantören"]
[null,"Myndighet/Organisation (namn)",null,null,null,null,null,"Organisationsnummer",null,"23.3-8004-18",null,null,null,null,null,"Ramavtalsleverantörens namn",null,null,null,null,null,"Organisationsnummer"]
[null,null,null,null,null,null,null,null,null,"Avropsblankett",null,null,null,null,null,null,null,null,null,null,null,{"$f":"IFERROR(INDEX(Admin!$E$61:$E$105,MATCH('1 Specifikation'!$P$9,Admin!$C$61:$C$105,0)),\"\")","v":""}]
[null,"Postadress",null,null,"Postnummer",null,null,"Ort",null,"Version 2,0",null,null,null,null,null,"Kontaktperson",null,null,null,"E-post"]
[null,null,null,null,null,null,null,null,null,null,null,null,null,null,null,{"$f":"IFERROR(INDEX(Admin!$L$61:$L$105,MATCH('1 Specifikation'!$P$9,Admin!$C$61:$C$105,0)),\"\")","v":""},null,null,null,{"$f":"IFERROR(INDEX(Admin!$N$61:$N$105,MATCH('1 Specifikation'!$P$9,Admin!$C$61:$C$105,0)),\"\")","v":""}]
[null,"Avdelning, enhet etc",null,null,"Kontaktperson",null,null,"Telefon",null,null,null,null,null,null,null,"Postadress",null,null,null,"Postnummer",null,"Ort"]
[null,null,null,null,null,null,null,null,null,null,null,null,null,null,null,{"$f":"IFERROR(INDEX(Admin!$F$61:$F$105,MATCH('1 Specifikation'!$P$9,Admin!$C$61:$C$105,0)),\"\")","v":""},null,null,null,{"$f":"IFERROR(INDEX(Admin!$G$61:$G$105,MATCH('1 Specifikation'!$P$9,Admin!$C$61:$C$105,0)),\"\")","v":""},null,{"$f":"IFERROR(INDEX(Admin!$H$61:$H$105,MATCH('1 Specifikation'!$P$9,Admin!$C$61:$C$105,0)),\"\")","v":""}]
[null,"Referens/diarienr för avropet",null,null,"E-post",null,null,null,null,null,null,null,null,null,null,"Telefon",null,null,null,"Offertnummer el likn för detta avropssvar"]
[null,null,null,null,null,null,null,null,null,null,null,null,null,null,null,{"$f":"IFERROR(INDEX(Admin!$M$61:$M$105,MATCH('1 Specifikation'!$P$9,Admin!$C$61:$C$105,0)),\"\")","v":""}]
[null,null,null,null,null,null,null,null,null,null,null,null,null,null,null,"Avropssvar lämnas Ja/Nej",null,null,"Om Nej, motivering"]
[null,null,null,null,"     ",null,null,null,null,null,null,null,null,null,null,null,null,null,null,null,null,null,null,null,null,null,null,null,null,null,null,null,null,{"$f":"IF(AND(P17=0,P17<>\"Ja\"),TRUE,FALSE)","v":true}]
[]
[null,"Förnyad kontroll av leverantörskrav (ESPD)",null,null,null,null,null,null,null,null,null,null,null,null,null,"Leverantörskrav (ESPD) - Ramavtalsleverantörens intygande"]
[null,"Enligt 15 kap. 4 § LOU krävs en ny leverantörskontroll, bl.a. av kvalificeringskraven, vid avrop genom förnyad konkurrensutsättning från ramavtal. Denna kontrollskyldighet ansvarar Kammarkollegiet för genom att löpande genomföra leverantörsprövning under hela ramavtalsperioden. Ramavtalsleverantören behöver dock bekräfta tidigare inlämnade uppgifter i enlighet med frågor till höger.",null,null,null,null,null,null,null,null,null,null,null,null,null,"Är i ramavtalsupphandlingen lämnad egenförsäkran fortfarande korrekt? ",null,null,null,"Ja/Nej"]
{"$rows_left_out":251}
{"sheet":"2 Avtalstecknande","index":1,"n_rows":33,"n_cols":5,"rows_kept":33,"cut":false,"hidden":false,"merged":[[37,1,37,3],[18,1,18,3],[33,1,33,3],[5,1,5,3],[34,1,34,3],[35,1,35,3],[36,1,36,3],[7,1,7,3],[9,1,9,3],[11,1,11,3],[14,1,14,3],[15,1,15,3]]}
[null,null,null,"Diarienr. för avropet:",{"$f":"'1 Specifikation'!B15","v":0}]
[null,null,null,"Nytt diarienr. för kontrakt:"]
[]
[]
[null,"Kontrakt"]
[null,{"$f":"\"Detta kontrakt reglerar avrop från ramavtalsområde \"&'1 Specifikation'!J5&\", \"&'1 Specifikation'!J8","v":"Detta kontrakt reglerar avrop från ramavtalsområde Möbler och inredning, 23.3-8004-18"}]
[null,"Kontraktets omfattning"]
[null,"Leveransens omfattning och villkor framgår av Kontraktet med tillhörande bilagor samt Ramavtalet. Om handlingarna innehåller motstridiga uppgifter ska handlingarna gälla i nedan nämnd ordning om inte omständigheterna uppenbarligen föranleder annat."]
[null,"1. Skriftliga ändringar och tillägg till Kontrakt"]
[null,"2. Kontrakt med bilagor, inkl. Allmänna villkor"]
[null,"3. Eventuellt kompletterande Avropsförfrågan"]
[null,"4. Avropsförfrågan med bilagor "]
[null,"5. Eventuella tillåtna kompletteringar av Avropssvar"]
[null,"6. Avropssvar med bilagor"]
[]
[null,"Innehåller leverantörens avropssvar uppgifter som inte efterfrågats i avropsblanketten är dessa uppgifter giltiga endast om en skriftlig överenskommelse träffas särskilt angående detta. Hänvisning till leverantörens egna allmänna villkor eller motsvarande är endast giltiga om en särskild överenskommelse avseende detta tecknas."]
[]
[null,"Underskrift"]
[null,"Underskriften avser ett kontraktstecknande. Efter undertecknande av bägge parter utgör denna blankett tillsammans med ramavtalets villkor enligt ovan ett kontrakt mellan parterna.\n\nDetta kontrakt har upprättats i två exemplar varav parterna tagit var sitt."]
[]
{"$rows_left_out":14}
{"sheet":"Admin","index":2,"n_rows":192,"n_cols":33,"rows_kept":192,"cut":false,"hidden":true,"merged":[]}
[null,null,null,null,null,null,null,null,null,null,null,null,null,null,null,"ResVarTja"]
[null,null,null,{"$f":"C6","v":"Arbetsplats och förvaring t.o.m. 500 000 SEK vid varje avrop"},{"$f":"C7","v":"Möten och paus t.o.m. 500 000 SEK vid varje avrop"},{"$f":"C8","v":"Textil och inredning för fönstermiljö t.o.m. 300 000 SEK vid varje avrop"},{"$f":"C9","v":"Arkiv och magasin t.o.m. 300 000 SEK vid varje avrop"},{"$f":"C10","v":"Förvaring i plåt t.o.m. 300 000 SEK vid varje avrop"},{"$f":"C11","v":"Utemöbler t.o.m. 100 000 SEK vid varje avrop"},{"$f":"C12","v":"Arbetsplatsarmaturer t.o.m. 100 000 SEK vid varje avrop"},{"$f":"C13","v":"Inredningsarmaturer t.o.m. 100 000 SEK vid varje avrop"},{"$f":"C14","v":"Skrivtavlor och AV-inredning t.o.m. 100 000 SEK vid varje avrop"},{"$f":"C15","v":"Lager och verkstadsmiljö t.o.m. 100 000 SEK vid varje avrop"},{"$f":"C16","v":"Textila mattor t.o.m. 300 000 SEK vid varje avrop"},{"$f":"C17","v":"Arbetsstolar t.o.m. 500 000 SEK vid varje avrop"},{"$f":"IF(USRDelområde=\"Välj delområde\",\"\",USRDelområde)","v":""}]
[null,null,"TblDelområde","Välj tjänst","Välj tjänst","Välj tjänst","Välj tjänst","Välj tjänst","Välj tjänst","Välj tjänst","Välj tjänst","Välj tjänst","Välj tjänst","Välj tjänst","Välj tjänst","Välj vara/tjänst"]
[]
[null,null,"Välj delområde","Stöd vid arbetsplatsutformning","Stöd vid arbetsplatsutformning","Akustikutredning, akustikmätning","Stöd vid arbetsplatsutformning","Mätning av rumsytor, golv och fönster","Märkning av t.ex. rumsnummer på möbler eller textilier","Stöd vid arbetsplatsutformning","Utplacering av varor på anvisade platser","Stöd vid arbetsplatsutformning","Utplacering av varor på anvisade platser","Utplacering av varor på anvisade platser","Stöd vid arbetsplatsutformning",{"$f":"IFERROR(IF(INDEX(D5:O5,MATCH(P$2,D$2:O$2,0))=0,\"\",INDEX(D5:O5,MATCH(P$2,D$2:O$2,0))),\"\")","v":""}]
[null,"A","Arbetsplats och förvaring t.o.m. 500 000 SEK vid varje avrop","Kompletta ritningsförslag","Kompletta ritningsförslag","Kompletta ritningsförslag","Kompletta ritningsförslag","Kompletta ritningsförslag","Utplacering av varor på anvisade platser","Kompletta ritningsförslag","Kompletta ritningsförslag","Kompletta ritningsförslag","Kompletta ritningsförslag","Kompletta ritningsförslag","Kompletta ritningsförslag",{"$f":"IFERROR(IF(INDEX(D6:O6,MATCH(P$2,D$2:O$2,0))=0,\"\",INDEX(D6:O6,MATCH(P$2,D$2:O$2,0))),\"\")","v":""}]
[null,"B","Möten och paus t.o.m. 500 000 SEK vid varje avrop","Akustikutredning, akustikmätning","Akustikutredning, akustikmätning","Mätning av rumsytor, golv och fönster","Mätning av rumsytor, golv och fönster","Utplacering av varor på anvisade platser","Efterdragning","Utplacering av varor på anvisade platser","Märkning av t.ex. rumsnummer på möbler eller textilier","Utplacering av varor på anvisade platser","Fast montering i byggnadsdel som golv, vägg och tak","Mattläggning","Utplacering av varor på anvisade platser",""]
[null,"C","Textil och inredning för fönstermiljö t.o.m. 300 000 SEK vid varje avrop","Mätning av rumsytor, golv och fönster","Mätning av rumsytor, golv och fönster","Utplacering av varor på anvisade platser","Utplacering av varor på anvisade platser","Fast montering i byggnadsdel som golv, vägg och tak","Efterkontroll, besiktning","Fast montering i byggnadsdel som golv, vägg och tak","Ritningsförslag - enklare skisser (kostnadsfritt)","Fast montering i byggnadsdel som golv, vägg och tak","Märkning av t.ex. rumsnummer på möbler eller textilier","Langettering","Märkning av t.ex. rumsnummer på möbler eller textilier",""]
[null,"D","Arkiv och magasin t.o.m. 300 000 SEK vid varje avrop","Utplacering av varor på anvisade platser","Utplacering av varor på anvisade platser","Sömnad, ändringssömnad, reparation","Fast montering i byggnadsdel som golv, vägg och tak","Märkning av t.ex. rumsnummer på möbler eller textilier","Ritningsförslag - enklare skisser (kostnadsfritt)","Märkning av t.ex. rumsnummer på möbler eller textilier",null,"Märkning av t.ex. rumsnummer på möbler eller textilier","Efterdragning","Märkning av t.ex. rumsnummer på möbler eller textilier","Efterkontroll, besiktning",""]
[null,"E","Förvaring i plåt t.o.m. 300 000 SEK vid varje avrop","Fast montering i byggnadsdel som golv, vägg och tak","Fast montering i byggnadsdel som golv, vägg och tak","Märkning av t.ex. rumsnummer på möbler eller textilier","Märkning av t.ex. rumsnummer på möbler eller textilier","Efterkontroll, besiktning",null,"Efterkontroll, besiktning",null,"Efterdragning","Efterkontroll, besiktning","Efterkontroll, besiktning","Ritningsförslag - enklare skisser (kostnadsfritt)",""]
[null,"F","Utemöbler t.o.m. 100 000 SEK vid varje avrop","Bordsskärmsmontering på befintliga bord","Märkning av t.ex. rumsnummer på möbler eller textilier","Tvättrådsmärkning i textilier","Nedmontering, uppmontering av befintliga kompaktarkiv","Ritningsförslag - enklare skisser (kostnadsfritt)",null,"Ritningsförslag - enklare skisser (kostnadsfritt)",null,"Efterkontroll, besiktning","Ritningsförslag - enklare skisser (kostnadsfritt)","Ritningsförslag - enklare skisser (kostnadsfritt)","Prov av kontorsarbetsstol (kostnadsfritt)",""]
[null,"G","Arbetsplatsarmaturer t.o.m. 100 000 SEK vid varje avrop","Märkning av t.ex. rumsnummer på möbler eller textilier","Efterdragning","Montering, uppsättning av hängande textilier","Bortforsling av nedmonterade eller utrangerade kompaktarkiv",null,null,"Prov av arbetsplatsarmatur (kostnadsfritt)",null,"Ritningsförslag - enklare skisser (kostnadsfritt)",null,null,null,""]
[null,"H","Inredningsarmaturer t.o.m. 100 000 SEK vid varje avrop","Efterdragning","Efterkontroll, besiktning","Efterkontroll, besiktning","Efterdragning",null,null,null,null,null,null,null,null,""]
[null,"I","Skrivtavlor och AV-inredning t.o.m. 100 000 SEK vid varje avrop","Efterkontroll, besiktning","Ritningsförslag - enklare skisser (kostnadsfritt)","Ritningsförslag - enklare skisser (kostnadsfritt)","Efterkontroll, besiktning",null,null,null,null,null,null,null,null,""]
[null,"J","Lager och verkstadsmiljö t.o.m. 100 000 SEK vid varje avrop","Ritningsförslag - enklare skisser (kostnadsfritt)",null,null,"Montering av arkivhyllor",null,null,null,null,null,null,null,null,""]
[null,"K","Textila mattor t.o.m. 300 000 SEK vid varje avrop",null,null,null,"Ritningsförslag - enklare skisser (kostnadsfritt)",null,null,null,null,null,null,null,null,""]
[null,"L","Arbetsstolar t.o.m. 500 000 SEK vid varje avrop",null,null,null,null,null,null,null,null,null,null,null,null,""]
[null,null,null,null,null,null,null,null,null,null,null,null,null,null,null,""]
[null,null,null,"Tjanster",null,null,null,null,null,null,null,null,null,null,null,"ResOpt"]
[null,null,null,"Välj Tjänst",{"$f":"D20","v":"Välj Tjänst"},{"$f":"E20","v":"Välj Tjänst"},{"$f":"F20","v":"Välj Tjänst"},{"$f":"G20","v":"Välj Tjänst"},{"$f":"H20","v":"Välj Tjänst"},{"$f":"I20","v":"Välj Tjänst"},"Välj Tjänst","Välj Tjänst","Välj Tjänst","Välj Tjänst",{"$f":"N20","v":"Välj Tjänst"},{"$f":"INDEX(D20:I20,MATCH(P$2,D$2:I$2,0))","v":{"$error":"#N/A"}}]
{"$rows_left_out":173}
{"sheet":"SysAdmin","index":3,"n_rows":9,"n_cols":5,"rows_kept":9,"cut":false,"hidden":true,"merged":[]}
["LockStatus",false]
["UKey","Förvaltning21",null,2,{"$f":"INDEX(E3:E5,D2)","v":"Avroppsblanketten är nu upplåst, klicka här för att låsa avropsblanketten."}]
["pkey","Förvaltning21",null,null,"Adminläge! Klicka här för att låsa vita celler."]
["Wkey","Förvaltning21","RGB",null,"Avroppsblanketten är nu upplåst, klicka här för att låsa avropsblanketten."]
["YColor"," ","255, 255, 153",null,"Avroppsblanketten är nu låst, klicka här för att låsa upp avropsblanketten."]
[null,null,"204, 255, 255"]
[null,null,"150, 150, 150",null,"Grund för tilldelning av kontrakt & Utvärderingsmodell"]
[null,null,"204, 255, 204",null,{"$f":"VALUE(IF(ISNUMBER(SEARCH(\"2\",DpDwnTDV))=TRUE,\"2\",\"1\"))","v":2}]
[null,null,"250, 191, 143",null,{"$f":"\"Alt\"&IF(ISNUMBER(SEARCH(\"1\",DpDwnUtvddrop))=TRUE,\"1\",IF(ISNUMBER(SEARCH(\"2\",DpDwnUtvddrop))=TRUE,\"2\",IF(ISNUMBER(SEARCH(\"3\",DpDwnUtvddrop))=TRUE,\"3\",IF(ISNUMBER(SEARCH(\"4\",DpDwnUtvddrop))=TRUE,\"4\"))))","v":"AltFALSE"}]